{"text_format":"3","workbook":"xlsx","n_sheets":5,"sheets":["Bezirksvereine","Mitglieder","Rundenwettkampfbericht","AllgemeineDaten","Erklärung"],"not_rendered":{"macros":1,"external_links":3,"defined_names":25},"read":"whole","date_system":"1900"}

{"sheet":"Bezirksvereine","index":0,"n_rows":74,"n_cols":3,"rows_kept":74,"hidden":true}
["VeNr","Kurz","VereinKurzBezeichnung"]
[2100001,1,"SV Tiefenbach"]
[2100002,2,"SV Tell Büblingshausen"]
[2100003,3,"SV Hermannstein"]
[2100004,4,"Vorstädter SV Wetzlar"]
[2100005,5,"SC Klein-Altenstädten"]
[2100006,6,"SV Steindorf"]
[2100007,7,"KSG Wetzlar"]
[2100008,8,"SV Münchholzhausen"]
[2100009,9,"SV Rabenau Garbenheim"]
[2100010,10,"SV Bonbaden"]
[2100011,11,"SV Kölschhausen"]
[2100012,12,"SV Schwalbach"]
[2100013,13,"SV Diana Weidenhausen"]
[2100014,14,"SV Werdorf"]
[2100015,15,"SV Laufdorf"]
[2100016,16,"SV Oberbiel"]
[2100017,17,"SV Stockhausen"]
[2100018,18,"SV Hüttenberg"]
[2100019,19,"TSV Nauborn"]
[2100020,20,"SV Ehringshausen-Dillheim"]
[2100021,21,"SV Hohensolms"]
[2100022,22,"SV Oberwetz"]
[2100023,23,"SPS Niederwetz"]
[2100024,24,"SV Biskirchen"]
[2100025,25,"SG Lahnau"]
[2100026,26,"SV Waldsolms"]
[2100027,27,"SV 1967 Solms"]
[2100028,28,"SV Nauborn"]
[2100029,29,"SV Reiskirchen"]
{"$rows_left_out":45}
{"sheet":"Mitglieder","index":1,"n_rows":8623,"n_cols":7,"rows_kept":8623,"hidden":true}
["VeNr","MgNr","Nummer","Vorname","Nachname","Nachname, Vorname","WkpStatus"]
[2100001,52,{"$f":"IF(B2<10,CONCATENATE(A2,\"000\",B2),IF(B2<100,CONCATENATE(A2,\"00\",B2),IF(B2<1000,CONCATENATE(A1,\"0\",B2),CONCATENATE(A1,B2))))","v":"21000010052"},"Wilfried","Weber",{"$f":"CONCATENATE(E2,\", \",D2)","v":"Weber, Wilfried"},0]
[2100001,173,{"$f":"IF(B3<10,CONCATENATE(A3,\"000\",B3),IF(B3<100,CONCATENATE(A3,\"00\",B3),IF(B3<1000,CONCATENATE(A2,\"0\",B3),CONCATENATE(A2,B3))))","v":"21000010173"},"Stephan","Partheil",{"$f":"CONCATENATE(E3,\", \",D3)","v":"Partheil, Stephan"},0]
[2100001,213,"21000010213","Hans Ulrich","Pfaff","Pfaff, Hans Ulrich",0]
[2100001,216,"21000010216","Karl-Heinz","Uhl","Uhl, Karl-Heinz",0]
[2100001,217,"21000010217","Martin","Krikau","Krikau, Martin",0]
[2100001,218,"21000010218","Björn","Bernhardt","Bernhardt, Björn",0]
[2100001,222,"21000010222","Thomas","Wagner","Wagner, Thomas",1]
[2100001,224,"21000010224","Michael","Jung","Jung, Michael",0]
[2100001,225,"21000010225","Marzena","Zubowska","Zubowska, Marzena",0]
[2100001,226,"21000010226","Kirsten","Warnke","Warnke, Kirsten",0]
[2100001,227,"21000010227","Marcus","Weiß","Weiß, Marcus",0]
[2100001,228,"21000010228","Jörg","Schmidt","Schmidt, Jörg",0]
[2100001,231,"21000010231","Gesa","Küthe","Küthe, Gesa",0]
[2100001,232,"21000010232","Emma","Küthe","Küthe, Emma",0]
[2100001,233,"21000010233","Holger","Daniel","Daniel, Holger",0]
[2100001,234,"21000010234","Ute","Dietrich","Dietrich, Ute",0]
[2100001,235,"21000010235","Marco","Deißmann","Deißmann, Marco",0]
[2100001,236,"21000010236","Silke","Wagner","Wagner, Silke",0]
[2100001,237,"21000010237","Frank","Scharf","Scharf, Frank",0]
[2100001,238,"21000010238","Holger","Klotz","Klotz, Holger",0]
[2100001,239,"21000010239","Tara","Schmidt","Schmidt, Tara",0]
[2100001,240,"21000010240","Alexander","Jagosch","Jagosch, Alexander",0]
[2100001,241,"21000010241","Patricia","Faulhaber-Schäfer","Faulhaber-Schäfer, Patricia",0]
[2100001,242,"21000010242","Alessandro","Faulhaber-Schäfer","Faulhaber-Schäfer, Alessandro",0]
[2100001,243,"21000010243","Susanne","Bezem","Bezem, Susanne",0]
[2100001,244,"21000010244","Tim","Bubalz","Bubalz, Tim",0]
[2100001,245,"21000010245","Calogero","Falanga","Falanga, Calogero",0]
[2100001,246,"21000010246","Astrid","Habig","Habig, Astrid",0]
[2100001,247,"21000010247","Rüdiger","Hofmann","Hofmann, Rüdiger",0]
{"$rows_left_out":8594}
{"sheet":"Rundenwettkampfbericht","index":2,"n_rows":75,"n_cols":65,"rows_kept":75,"merged":[[0,0,1,6],[0,7,1,23],[0,30,1,34],[0,35,1,49],[0,57,1,60],[0,61,1,67],[3,0,6,1],[3,2,3,8],[3,9,3,30],[3,31,3,33],[3,36,3,57],[3,58,3,60],[3,61,3,67],[4,2,5,8],[4,9,5,30],[4,31,5,33],[4,36,5,57],[4,58,5,60],[4,61,5,67],[6,2,6,5],[6,6,6,23],[6,24,6,26],[6,27,6,30],[6,31,6,33],[6,36,6,38],[6,39,6,42],[6,43,6,45],[6,46,6,63],[6,64,6,67],[7,0,16,0],[7,1,8,1],[7,2,8,5],[7,6,8,23],[7,24,8,26],[7,27,8,30],[7,31,8,33],[7,36,8,38],[7,39,8,42],[7,43,8,45],[7,46,8,63],[7,64,8,67],[9,1,10,1],[9,2,10,5],[9,6,10,23],[9,24,10,26],[9,27,10,30],[9,31,10,33],[9,36,10,38],[9,39,10,42],[9,43,10,45],[9,46,10,63],[9,64,10,67],[11,1,12,1],[11,2,12,5],[11,6,12,23],[11,24,12,26],[11,27,12,30],[11,31,12,33],[11,36,12,38],[11,39,12,42],[11,43,12,45],[11,46,12,63],[11,64,12,67],[13,1,14,1],[13,2,14,5],[13,6,14,23],[13,24,14,26],[13,27,14,30],[13,31,14,33],[13,36,14,38],[13,39,14,42],[13,43,14,45],[13,46,14,63],[13,64,14,67],[15,1,16,1],[15,2,16,23],[15,24,16,26],[15,27,16,30],[15,31,16,33],[15,36,16,38],[15,39,16,42],[15,43,16,45],[17,21,18,30],[17,31,18,33],[17,36,18,38],[19,21,20,30],[19,31,20,33],[19,34,20,35],[19,36,20,38],[23,2,23,5],[23,6,23,29],[23,30,23,33],[23,36,23,39],[23,40,23,63],[23,64,23,67],[24,0,31,1],[24,2,25,5],[24,6,25,29],[24,30,25,33],[24,36,25,39],[24,40,25,63],[24,64,25,67],[26,2,27,5],[26,6,27,29],[26,30,27,33],[26,36,27,39],[26,40,27,63],[26,64,27,67],[28,2,29,5],[28,6,29,29],[28,30,29,33],[28,36,29,39],[28,40,29,63],[28,64,29,67],[30,2,31,5],[30,6,31,29],[30,30,31,33],[30,36,31,39],[30,40,31,63],[30,64,31,67],[32,0,35,1],[32,2,32,8],[32,9,32,29],[32,30,32,33],[32,36,32,56],[32,57,32,60],[32,61,32,67],[33,2,34,8],[33,9,34,29],[33,30,34,33],[33,36,34,56],[33,57,34,60],[33,61,34,67],[35,2,35,5],[35,6,35,29],[35,30,35,33],[35,36,35,39],[35,40,35,63],[35,64,35,67],[36,0,45,0],[36,1,37,1],[36,2,37,5],[36,6,37,29],[36,30,37,33],[36,36,37,39],[36,40,37,63],[36,64,37,67],[38,1,39,1],[38,2,39,5],[38,6,39,29],[38,30,39,33],[38,36,39,39],[38,40,39,63],[38,64,39,67],[40,1,41,1],[40,2,41,5],[40,6,41,29],[40,30,41,33],[40,36,41,39],[40,40,41,63],[40,64,41,67],[42,1,43,1],[42,2,43,5],[42,6,43,29],[42,30,43,33],[42,36,43,39],[42,40,43,63],[42,64,43,67],[44,1,45,1],[44,2,45,29],[44,30,45,33],[44,36,45,39],[47,21,49,30],[47,31,49,33],[47,34,49,35],[47,36,49,38],[52,2,52,5],[52,6,52,29],[52,30,52,33],[52,36,52,39],[52,40,52,63],[52,64,52,67],[53,0,60,1],[53,2,54,5],[53,6,54,29],[53,30,54,33],[53,36,54,39],[53,40,54,63],[53,64,54,67],[55,2,56,5],[55,6,56,29],[55,30,56,33],[55,36,56,39],[55,40,56,63],[55,64,56,67],[57,2,58,5],[57,6,58,29],[57,30,58,33],[57,36,58,39],[57,40,58,63],[57,64,58,67],[59,2,60,5],[59,6,60,29],[59,30,60,33],[59,36,60,39],[59,40,60,63],[59,64,60,67],[63,1,64,21],[63,22,64,47],[63,48,64,66],[65,1,66,32],[65,35,66,66],[67,1,68,32],[67,35,68,66],[69,1,70,32],[69,35,70,66],[74,0,75,10]]}
["Wettbewerb:",{"$nulls":29},"Klasse:",{"$nulls":26},"Datum:"]
[]
[]
["#",null,"Vereinsnummer",{"$nulls":6},"Mannschaftsname (Heim-Mannschaft)",{"$nulls":21},"#",{"$nulls":4},"Mannschaftsname (Gast-Mannschaft)",{"$nulls":21},"#",null,null,"Vereinsnummer"]
[{"$nulls":9},{"$f":"IF(C5>0,VLOOKUP(C5,Bezirksvereine!B1:C76,2,FALSE),\"\")","v":""},{"$nulls":26},{"$f":"IF(BJ5>0,VLOOKUP(BJ5,Bezirksvereine!B1:C76,2,FALSE),\"\")","v":""}]
[]
[null,null,"Pass-Nr.",{"$nulls":3},"Name, Vorname",{"$nulls":17},"Stech.",null,null,"Ringe",{"$nulls":3},"Punkte",{"$nulls":4},"Punkte",null,null,"Ringe",{"$nulls":3},"Stech.",null,null,"Name, Vorname",{"$nulls":17},"Pass-Nr."]
["Position","1",{"$nulls":4},{"$f":"IF(ISNA(IF(AND(C$5>0,C8>0),CONCATENATE(VLOOKUP(CONCATENATE(\"21000\",IF(C$5<10,\"0\",\"\"),C$5,IF(C8<10,\"000\",IF(C8<100,\"00\",IF(C8<1000,\"0\",\"\"))),C8),Mitglieder!C$1:G$10000,3,FALSE),\", \",VLOOKUP(CONCATENATE(\"21000\",IF(C$5<10,\"0\",\"\"),C$5,IF(C8<10,\"000\",IF(C8<100,\"00\",IF(C8<1000,\"0\",\"\"))),C8),Mitglieder!C$1:G$10000,2,FALSE)),\"\"))=TRUE,\"Passnummer unbekannt!\",IF(AND(C$5>0,C8>0),CONCATENATE(VLOOKUP(CONCATENATE(\"21000\",IF(C$5<10,\"0\",\"\"),C$5,IF(C8<10,\"000\",IF(C8<100,\"00\",IF(C8<1000,\"0\",\"\"))),C8),Mitglieder!C$1:G$10000,3,FALSE),\", \",VLOOKUP(CONCATENATE(\"21000\",IF(C$5<10,\"0\",\"\"),C$5,IF(C8<10,\"000\",IF(C8<100,\"00\",IF(C8<1000,\"0\",\"\"))),C8),Mitglieder!C$1:G$10000,2,FALSE)),\"\"))","v":""},{"$nulls":24},{"$f":"IF(AB8<AN8,0,IF(AB8>AN8,1,IF(AND(AB8>0,AB8=AN8,Y8=1)=TRUE,1,IF(AND(AB8>0,AB8=AN8,AR8=1)=TRUE,0,\"\"))))","v":""},{"$nulls":4},{"$f":"IF(AF8=1,0,IF(AF8=0,1,\"\"))","v":""},{"$nulls":6},{"$f":"IF(Y8=\"\",\"\",IF(Y8=0,1,0))","v":""},null,null,{"$f":"IF(ISNA(IF(AND(BJ$5>0,BM8>0),CONCATENATE(VLOOKUP(CONCATENATE(\"21000\",IF(BJ$5<10,\"0\",\"\"),BJ$5,IF(BM8<10,\"000\",IF(BM8<100,\"00\",IF(BM8<1000,\"0\",\"\"))),BM8),Mitglieder!C$1:G$10000,3,FALSE),\", \",VLOOKUP(CONCATENATE(\"21000\",IF(BJ$5<10,\"0\",\"\"),BJ$5,IF(BM8<10,\"000\",IF(BM8<100,\"00\",IF(BM8<1000,\"0\",\"\"))),BM8),Mitglieder!C$1:G$10000,2,FALSE)),\"\"))=TRUE,\"Passnummer unbekannt!\",IF(AND(BJ$5>0,BM8>0),CONCATENATE(VLOOKUP(CONCATENATE(\"21000\",IF(BJ$5<10,\"0\",\"\"),BJ$5,IF(BM8<10,\"000\",IF(BM8<100,\"00\",IF(BM8<1000,\"0\",\"\"))),BM8),Mitglieder!C$1:G$10000,3,FALSE),\", \",VLOOKUP(CONCATENATE(\"21000\",IF(BJ$5<10,\"0\",\"\"),BJ$5,IF(BM8<10,\"000\",IF(BM8<100,\"00\",IF(BM8<1000,\"0\",\"\"))),BM8),Mitglieder!C$1:G$10000,2,FALSE)),\"\"))","v":""}]
[]
[null,"2",{"$nulls":4},{"$f":"IF(ISNA(IF(AND(C$5>0,C10>0),CONCATENATE(VLOOKUP(CONCATENATE(\"21000\",IF(C$5<10,\"0\",\"\"),C$5,IF(C10<10,\"000\",IF(C10<100,\"00\",IF(C10<1000,\"0\",\"\"))),C10),Mitglieder!C$1:G$10000,3,FALSE),\", \",VLOOKUP(CONCATENATE(\"21000\",IF(C$5<10,\"0\",\"\"),C$5,IF(C10<10,\"000\",IF(C10<100,\"00\",IF(C10<1000,\"0\",\"\"))),C10),Mitglieder!C$1:G$10000,2,FALSE)),\"\"))=TRUE,\"Passnummer unbekannt!\",IF(AND(C$5>0,C10>0),CONCATENATE(VLOOKUP(CONCATENATE(\"21000\",IF(C$5<10,\"0\",\"\"),C$5,IF(C10<10,\"000\",IF(C10<100,\"00\",IF(C10<1000,\"0\",\"\"))),C10),Mitglieder!C$1:G$10000,3,FALSE),\", \",VLOOKUP(CONCATENATE(\"21000\",IF(C$5<10,\"0\",\"\"),C$5,IF(C10<10,\"000\",IF(C10<100,\"00\",IF(C10<1000,\"0\",\"\"))),C10),Mitglieder!C$1:G$10000,2,FALSE)),\"\"))","v":""},{"$nulls":24},{"$f":"IF(AB10<AN10,0,IF(AB10>AN10,1,IF(AND(AB10>0,AB10=AN10,Y10=1)=TRUE,1,IF(AND(AB10>0,AB10=AN10,AR10=1)=TRUE,0,\"\"))))","v":""},{"$nulls":4},{"$f":"IF(AF10=1,0,IF(AF10=0,1,\"\"))","v":""},{"$nulls":6},{"$f":"IF(Y10=\"\",\"\",IF(Y10=0,1,0))","v":""},null,null,{"$f":"IF(ISNA(IF(AND(BJ$5>0,BM10>0),CONCATENATE(VLOOKUP(CONCATENATE(\"21000\",IF(BJ$5<10,\"0\",\"\"),BJ$5,IF(BM10<10,\"000\",IF(BM10<100,\"00\",IF(BM10<1000,\"0\",\"\"))),BM10),Mitglieder!C$1:G$10000,3,FALSE),\", \",VLOOKUP(CONCATENATE(\"21000\",IF(BJ$5<10,\"0\",\"\"),BJ$5,IF(BM10<10,\"000\",IF(BM10<100,\"00\",IF(BM10<1000,\"0\",\"\"))),BM10),Mitglieder!C$1:G$10000,2,FALSE)),\"\"))=TRUE,\"Passnummer unbekannt!\",IF(AND(BJ$5>0,BM10>0),CONCATENATE(VLOOKUP(CONCATENATE(\"21000\",IF(BJ$5<10,\"0\",\"\"),BJ$5,IF(BM10<10,\"000\",IF(BM10<100,\"00\",IF(BM10<1000,\"0\",\"\"))),BM10),Mitglieder!C$1:G$10000,3,FALSE),\", \",VLOOKUP(CONCATENATE(\"21000\",IF(BJ$5<10,\"0\",\"\"),BJ$5,IF(BM10<10,\"000\",IF(BM10<100,\"00\",IF(BM10<1000,\"0\",\"\"))),BM10),Mitglieder!C$1:G$10000,2,FALSE)),\"\"))","v":""}]
[]
[null,"3",{"$nulls":4},{"$f":"IF(ISNA(IF(AND(C$5>0,C12>0),CONCATENATE(VLOOKUP(CONCATENATE(\"21000\",IF(C$5<10,\"0\",\"\"),C$5,IF(C12<10,\"000\",IF(C12<100,\"00\",IF(C12<1000,\"0\",\"\"))),C12),Mitglieder!C$1:G$10000,3,FALSE),\", \",VLOOKUP(CONCATENATE(\"21000\",IF(C$5<10,\"0\",\"\"),C$5,IF(C12<10,\"000\",IF(C12<100,\"00\",IF(C12<1000,\"0\",\"\"))),C12),Mitglieder!C$1:G$10000,2,FALSE)),\"\"))=TRUE,\"Passnummer unbekannt!\",IF(AND(C$5>0,C12>0),CONCATENATE(VLOOKUP(CONCATENATE(\"21000\",IF(C$5<10,\"0\",\"\"),C$5,IF(C12<10,\"000\",IF(C12<100,\"00\",IF(C12<1000,\"0\",\"\"))),C12),Mitglieder!C$1:G$10000,3,FALSE),\", \",VLOOKUP(CONCATENATE(\"21000\",IF(C$5<10,\"0\",\"\"),C$5,IF(C12<10,\"000\",IF(C12<100,\"00\",IF(C12<1000,\"0\",\"\"))),C12),Mitglieder!C$1:G$10000,2,FALSE)),\"\"))","v":""},{"$nulls":24},{"$f":"IF(AB12<AN12,0,IF(AB12>AN12,1,IF(AND(AB12>0,AB12=AN12,Y12=1)=TRUE,1,IF(AND(AB12>0,AB12=AN12,AR12=1)=TRUE,0,\"\"))))","v":""},{"$nulls":4},{"$f":"IF(AF12=1,0,IF(AF12=0,1,\"\"))","v":""},{"$nulls":6},{"$f":"IF(Y12=\"\",\"\",IF(Y12=0,1,0))","v":""},null,null,{"$f":"IF(ISNA(IF(AND(BJ$5>0,BM12>0),CONCATENATE(VLOOKUP(CONCATENATE(\"21000\",IF(BJ$5<10,\"0\",\"\"),BJ$5,IF(BM12<10,\"000\",IF(BM12<100,\"00\",IF(BM12<1000,\"0\",\"\"))),BM12),Mitglieder!C$1:G$10000,3,FALSE),\", \",VLOOKUP(CONCATENATE(\"21000\",IF(BJ$5<10,\"0\",\"\"),BJ$5,IF(BM12<10,\"000\",IF(BM12<100,\"00\",IF(BM12<1000,\"0\",\"\"))),BM12),Mitglieder!C$1:G$10000,2,FALSE)),\"\"))=TRUE,\"Passnummer unbekannt!\",IF(AND(BJ$5>0,BM12>0),CONCATENATE(VLOOKUP(CONCATENATE(\"21000\",IF(BJ$5<10,\"0\",\"\"),BJ$5,IF(BM12<10,\"000\",IF(BM12<100,\"00\",IF(BM12<1000,\"0\",\"\"))),BM12),Mitglieder!C$1:G$10000,3,FALSE),\", \",VLOOKUP(CONCATENATE(\"21000\",IF(BJ$5<10,\"0\",\"\"),BJ$5,IF(BM12<10,\"000\",IF(BM12<100,\"00\",IF(BM12<1000,\"0\",\"\"))),BM12),Mitglieder!C$1:G$10000,2,FALSE)),\"\"))","v":""}]
[]
[null,{"$f":"IF(OR(C14>0,BM14>0)=TRUE,\"4\",\"\")","v":""},{"$nulls":4},{"$f":"IF(ISNA(IF(AND(C$5>0,C14>0),CONCATENATE(VLOOKUP(CONCATENATE(\"21000\",IF(C$5<10,\"0\",\"\"),C$5,IF(C14<10,\"000\",IF(C14<100,\"00\",IF(C14<1000,\"0\",\"\"))),C14),Mitglieder!C$1:G$10000,3,FALSE),\", \",VLOOKUP(CONCATENATE(\"21000\",IF(C$5<10,\"0\",\"\"),C$5,IF(C14<10,\"000\",IF(C14<100,\"00\",IF(C14<1000,\"0\",\"\"))),C14),Mitglieder!C$1:G$10000,2,FALSE)),\"\"))=TRUE,\"Passnummer unbekannt!\",IF(AND(C$5>0,C14>0),CONCATENATE(VLOOKUP(CONCATENATE(\"21000\",IF(C$5<10,\"0\",\"\"),C$5,IF(C14<10,\"000\",IF(C14<100,\"00\",IF(C14<1000,\"0\",\"\"))),C14),Mitglieder!C$1:G$10000,3,FALSE),\", \",VLOOKUP(CONCATENATE(\"21000\",IF(C$5<10,\"0\",\"\"),C$5,IF(C14<10,\"000\",IF(C14<100,\"00\",IF(C14<1000,\"0\",\"\"))),C14),Mitglieder!C$1:G$10000,2,FALSE)),\"\"))","v":""},{"$nulls":24},{"$f":"IF(AB14<AN14,0,IF(AB14>AN14,1,IF(AND(AB14>0,AB14=AN14,Y14=1)=TRUE,1,IF(AND(AB14>0,AB14=AN14,AR14=1)=TRUE,0,\"\"))))","v":""},{"$nulls":4},{"$f":"IF(AF14=1,0,IF(AF14=0,1,\"\"))","v":""},{"$nulls":6},{"$f":"IF(Y14=\"\",\"\",IF(Y14=0,1,0))","v":""},null,null,{"$f":"IF(ISNA(IF(AND(BJ$5>0,BM14>0),CONCATENATE(VLOOKUP(CONCATENATE(\"21000\",IF(BJ$5<10,\"0\",\"\"),BJ$5,IF(BM14<10,\"000\",IF(BM14<100,\"00\",IF(BM14<1000,\"0\",\"\"))),BM14),Mitglieder!C$1:G$10000,3,FALSE),\", \",VLOOKUP(CONCATENATE(\"21000\",IF(BJ$5<10,\"0\",\"\"),BJ$5,IF(BM14<10,\"000\",IF(BM14<100,\"00\",IF(BM14<1000,\"0\",\"\"))),BM14),Mitglieder!C$1:G$10000,2,FALSE)),\"\"))=TRUE,\"Passnummer unbekannt!\",IF(AND(BJ$5>0,BM14>0),CONCATENATE(VLOOKUP(CONCATENATE(\"21000\",IF(BJ$5<10,\"0\",\"\"),BJ$5,IF(BM14<10,\"000\",IF(BM14<100,\"00\",IF(BM14<1000,\"0\",\"\"))),BM14),Mitglieder!C$1:G$10000,3,FALSE),\", \",VLOOKUP(CONCATENATE(\"21000\",IF(BJ$5<10,\"0\",\"\"),BJ$5,IF(BM14<10,\"000\",IF(BM14<100,\"00\",IF(BM14<1000,\"0\",\"\"))),BM14),Mitglieder!C$1:G$10000,2,FALSE)),\"\"))","v":""}]
[]
[null,{"$f":"IF(OR(C14>0,BM14>0)=TRUE,\"5\",\"4\")","v":"4"},"Mannschaftswertung:",{"$nulls":24},{"$f":"IF(SUM(AB8:AE15)>0,SUM(AB8:AE15),-2)","v":-2},{"$nulls":3},{"$f":"IF(AB16<AN16,0,IF(AB16>AN16,1,IF(AND(AB16>0,AB16=AN16,Y16=1)=TRUE,1,IF(AND(AB16>0,AB16=AN16,AR16=1)=TRUE,0,\"\"))))","v":""},{"$nulls":4},{"$f":"IF(AF16=1,0,IF(AF16=0,1,\"\"))","v":""},null,null,{"$f":"IF(SUM(AN8:AQ15)>0,SUM(AN8:AQ15),-2)","v":-2},{"$nulls":3},{"$f":"IF(Y16=\"\",\"\",IF(Y16=0,1,0))","v":""}]
[]
[{"$nulls":21},"Gesamtpunke:",{"$nulls":9},{"$f":"IF(SUM(AF8:AH17,AK8:AM17)>0,SUM(AF8:AH17),\"\")","v":""},{"$nulls":4},{"$f":"IF(SUM(AK8:AM17,AF8:AH17)>0,SUM(AK8:AM17),\"\")","v":""}]
[]
[{"$nulls":21},"Mannschaftspunkte:",{"$nulls":9},{"$f":"IF(SUM(AF18,AK18)>0,IF(AF18<AK18,0,2),\"\")","v":""},null,null,":",null,{"$f":"IF(SUM(AF18,AK18)>0,IF(AF18<AK18,2,0),\"\")","v":""}]
[]
[]
[]
[null,null,"Pass-Nr.",{"$nulls":3},"Name, Vorname",{"$nulls":23},"Ringe",{"$nulls":5},"Ringe",{"$nulls":3},"Name, Vorname",{"$nulls":23},"Pass-Nr."]
["Ersatz",{"$nulls":5},{"$f":"IF(ISNA(IF(AND(C$5>0,C25>0),CONCATENATE(VLOOKUP(CONCATENATE(\"21000\",IF(C$5<10,\"0\",\"\"),C$5,IF(C25<10,\"000\",IF(C25<100,\"00\",IF(C25<1000,\"0\",\"\"))),C25),Mitglieder!C$1:G$10000,3,FALSE),\", \",VLOOKUP(CONCATENATE(\"21000\",IF(C$5<10,\"0\",\"\"),C$5,IF(C25<10,\"000\",IF(C25<100,\"00\",IF(C25<1000,\"0\",\"\"))),C25),Mitglieder!C$1:G$10000,2,FALSE)),\"\"))=TRUE,\"Passnummer unbekannt!\",IF(AND(C$5>0,C25>0),CONCATENATE(VLOOKUP(CONCATENATE(\"21000\",IF(C$5<10,\"0\",\"\"),C$5,IF(C25<10,\"000\",IF(C25<100,\"00\",IF(C25<1000,\"0\",\"\"))),C25),Mitglieder!C$1:G$10000,3,FALSE),\", \",VLOOKUP(CONCATENATE(\"21000\",IF(C$5<10,\"0\",\"\"),C$5,IF(C25<10,\"000\",IF(C25<100,\"00\",IF(C25<1000,\"0\",\"\"))),C25),Mitglieder!C$1:G$10000,2,FALSE)),\"\"))","v":""},{"$nulls":33},{"$f":"IF(ISNA(IF(AND(BJ$5>0,BM25>0),CONCATENATE(VLOOKUP(CONCATENATE(\"21000\",IF(BJ$5<10,\"0\",\"\"),BJ$5,IF(BM25<10,\"000\",IF(BM25<100,\"00\",IF(BM25<1000,\"0\",\"\"))),BM25),Mitglieder!C$1:G$10000,3,FALSE),\", \",VLOOKUP(CONCATENATE(\"21000\",IF(BJ$5<10,\"0\",\"\"),BJ$5,IF(BM25<10,\"000\",IF(BM25<100,\"00\",IF(BM25<1000,\"0\",\"\"))),BM25),Mitglieder!C$1:G$10000,2,FALSE)),\"\"))=TRUE,\"Passnummer unbekannt!\",IF(AND(BJ$5>0,BM25>0),CONCATENATE(VLOOKUP(CONCATENATE(\"21000\",IF(BJ$5<10,\"0\",\"\"),BJ$5,IF(BM25<10,\"000\",IF(BM25<100,\"00\",IF(BM25<1000,\"0\",\"\"))),BM25),Mitglieder!C$1:G$10000,3,FALSE),\", \",VLOOKUP(CONCATENATE(\"21000\",IF(BJ$5<10,\"0\",\"\"),BJ$5,IF(BM25<10,\"000\",IF(BM25<100,\"00\",IF(BM25<1000,\"0\",\"\"))),BM25),Mitglieder!C$1:G$10000,2,FALSE)),\"\"))","v":""}]
[]
[{"$nulls":6},{"$f":"IF(ISNA(IF(AND(C$5>0,C27>0),CONCATENATE(VLOOKUP(CONCATENATE(\"21000\",IF(C$5<10,\"0\",\"\"),C$5,IF(C27<10,\"000\",IF(C27<100,\"00\",IF(C27<1000,\"0\",\"\"))),C27),Mitglieder!C$1:G$10000,3,FALSE),\", \",VLOOKUP(CONCATENATE(\"21000\",IF(C$5<10,\"0\",\"\"),C$5,IF(C27<10,\"000\",IF(C27<100,\"00\",IF(C27<1000,\"0\",\"\"))),C27),Mitglieder!C$1:G$10000,2,FALSE)),\"\"))=TRUE,\"Passnummer unbekannt!\",IF(AND(C$5>0,C27>0),CONCATENATE(VLOOKUP(CONCATENATE(\"21000\",IF(C$5<10,\"0\",\"\"),C$5,IF(C27<10,\"000\",IF(C27<100,\"00\",IF(C27<1000,\"0\",\"\"))),C27),Mitglieder!C$1:G$10000,3,FALSE),\", \",VLOOKUP(CONCATENATE(\"21000\",IF(C$5<10,\"0\",\"\"),C$5,IF(C27<10,\"000\",IF(C27<100,\"00\",IF(C27<1000,\"0\",\"\"))),C27),Mitglieder!C$1:G$10000,2,FALSE)),\"\"))","v":""},{"$nulls":33},{"$f":"IF(ISNA(IF(AND(BJ$5>0,BM27>0),CONCATENATE(VLOOKUP(CONCATENATE(\"21000\",IF(BJ$5<10,\"0\",\"\"),BJ$5,IF(BM27<10,\"000\",IF(BM27<100,\"00\",IF(BM27<1000,\"0\",\"\"))),BM27),Mitglieder!C$1:G$10000,3,FALSE),\", \",VLOOKUP(CONCATENATE(\"21000\",IF(BJ$5<10,\"0\",\"\"),BJ$5,IF(BM27<10,\"000\",IF(BM27<100,\"00\",IF(BM27<1000,\"0\",\"\"))),BM27),Mitglieder!C$1:G$10000,2,FALSE)),\"\"))=TRUE,\"Passnummer unbekannt!\",IF(AND(BJ$5>0,BM27>0),CONCATENATE(VLOOKUP(CONCATENATE(\"21000\",IF(BJ$5<10,\"0\",\"\"),BJ$5,IF(BM27<10,\"000\",IF(BM27<100,\"00\",IF(BM27<1000,\"0\",\"\"))),BM27),Mitglieder!C$1:G$10000,3,FALSE),\", \",VLOOKUP(CONCATENATE(\"21000\",IF(BJ$5<10,\"0\",\"\"),BJ$5,IF(BM27<10,\"000\",IF(BM27<100,\"00\",IF(BM27<1000,\"0\",\"\"))),BM27),Mitglieder!C$1:G$10000,2,FALSE)),\"\"))","v":""}]
[]
[{"$nulls":6},{"$f":"IF(ISNA(IF(AND(C$5>0,C29>0),CONCATENATE(VLOOKUP(CONCATENATE(\"21000\",IF(C$5<10,\"0\",\"\"),C$5,IF(C29<10,\"000\",IF(C29<100,\"00\",IF(C29<1000,\"0\",\"\"))),C29),Mitglieder!C$1:G$10000,3,FALSE),\", \",VLOOKUP(CONCATENATE(\"21000\",IF(C$5<10,\"0\",\"\"),C$5,IF(C29<10,\"000\",IF(C29<100,\"00\",IF(C29<1000,\"0\",\"\"))),C29),Mitglieder!C$1:G$10000,2,FALSE)),\"\"))=TRUE,\"Passnummer unbekannt!\",IF(AND(C$5>0,C29>0),CONCATENATE(VLOOKUP(CONCATENATE(\"21000\",IF(C$5<10,\"0\",\"\"),C$5,IF(C29<10,\"000\",IF(C29<100,\"00\",IF(C29<1000,\"0\",\"\"))),C29),Mitglieder!C$1:G$10000,3,FALSE),\", \",VLOOKUP(CONCATENATE(\"21000\",IF(C$5<10,\"0\",\"\"),C$5,IF(C29<10,\"000\",IF(C29<100,\"00\",IF(C29<1000,\"0\",\"\"))),C29),Mitglieder!C$1:G$10000,2,FALSE)),\"\"))","v":""},{"$nulls":33},{"$f":"IF(ISNA(IF(AND(BJ$5>0,BM29>0),CONCATENATE(VLOOKUP(CONCATENATE(\"21000\",IF(BJ$5<10,\"0\",\"\"),BJ$5,IF(BM29<10,\"000\",IF(BM29<100,\"00\",IF(BM29<1000,\"0\",\"\"))),BM29),Mitglieder!C$1:G$10000,3,FALSE),\", \",VLOOKUP(CONCATENATE(\"21000\",IF(BJ$5<10,\"0\",\"\"),BJ$5,IF(BM29<10,\"000\",IF(BM29<100,\"00\",IF(BM29<1000,\"0\",\"\"))),BM29),Mitglieder!C$1:G$10000,2,FALSE)),\"\"))=TRUE,\"Passnummer unbekannt!\",IF(AND(BJ$5>0,BM29>0),CONCATENATE(VLOOKUP(CONCATENATE(\"21000\",IF(BJ$5<10,\"0\",\"\"),BJ$5,IF(BM29<10,\"000\",IF(BM29<100,\"00\",IF(BM29<1000,\"0\",\"\"))),BM29),Mitglieder!C$1:G$10000,3,FALSE),\", \",VLOOKUP(CONCATENATE(\"21000\",IF(BJ$5<10,\"0\",\"\"),BJ$5,IF(BM29<10,\"000\",IF(BM29<100,\"00\",IF(BM29<1000,\"0\",\"\"))),BM29),Mitglieder!C$1:G$10000,2,FALSE)),\"\"))","v":""}]
[]
{"$rows_left_out":37}
{"sheet":"AllgemeineDaten","index":3,"n_rows":18,"n_cols":4,"rows_kept":18,"hidden":true}
["Wettbewerb","Klassen","Datum","Mannnschaftsnummer"]
["Luftgewehr","Bezirksliga",{"$f":"TODAY()","v":"2018-09-12"},1]
["Luftgewehr Auflage","Kreisklasse Dillenburg",null,2]
["Luftgewehr Alt","Grundklasse 1 Dillenburg",null,3]
["Luftpistole","Grundklasse 2 Dillenburg",null,4]
["Luftpistole Auflage","Grundklasse 3 Dillenburg",null,5]
["Ordonnanzgewehr","Grundklasse 4 Dillenburg",null,6]
["Großkaliber Pistole / Revolver","Grundklasse 5 Dillenburg",null,7]
["KK Sportgewehr","Kreisklasse Wetzlar",null,8]
["KK Sportpistole","Grundklasse 1 Wetzlar",null,9]
["KK Liegendkampf","Grundklasse 2 Wetzlar"]
["Sportgewehr Auflage","Grundklasse 3 Wetzlar"]
["Perkussionsgewehr","Grundklasse 4 Wetzlar"]
["Perkusionspistole","Grundklasse 5 Wetzlar"]
["Freie Pistole"]
["Standardpistole"]
["Bogen Halle"]
["Bogen Freien"]

{"sheet":"Erklärung","index":4,"n_rows":30,"n_cols":2,"rows_kept":30}
[null,"Rundenwettkampfbericht für den Schützenbezirk 21 Lahn-Dill"]
[]
[null,"Der Rundenwettkampfbericht ist weitestgehend selbsterklärend und dient lediglich als Alternative, falls eine direkte Eingabe in den Onlinemelder nicht möglich ist."]
[null,"Diese Datei ersetzt nicht die Eingabe der Ergebnisse in den Onlinemelder!"]
[null,"Diese Datei soll in den Vereinen eingesetzt werden, die im Schützenhaus keine Internetverbindung haben und dient als Unterstützung beim Bestreiten des Wettkampfs."]
[null,"Voraussetzungen um mit diesem Programm arbeiten zu können ist ein Windows Betriebssystem mit einem Office Paket 2010 oder jünger."]
[]
[1,"Es können nur Zellen ausgewählt werden, die für Eingaben freigegeben sind. Sprich, es ist nicht möglich Formeln oder Formatierungen zu ändern oder zu löschen."]
["1a","Alle Felder deren Bezeichnungen fett geschrieben sind, sind Eingabefelder, die ausgefüllt werden müssen/können. "]
["1b","Als optische Unterstützung sind auszufüllende Zellen mit bleuem Rahmen versehen."]
[2,"Bei den Eingaben \"Wettbewerb\" und \"Klasse\" handelt es sich um DropDown Felder, die keine anderen Eingaben, als die in der Auswahl vorgegebenen, zulassen."]
[3,"Je nach Klasse (Bezirksliga oder Kreis- und Grundklassen) wird der Bericht automatisch angepasst."]
[4,"Es gibt fast zu jedem Eingabefeld, wie zum Beispiel dem Datum, Erklärungen mit den Informationen was eingetragen werden kann/darf."]
[5,"Bei der Vereinsnummer dürfen nur die letzten beiden Ziffern der Vereinsnummer eingetragen werden!"]
["5a","Der Mannschaftsname erscheint dann automatisch. Bitte auch das Feld für die Mannschaftsnummer ausfüllen!"]
[6,"Die Passnummern werden nur vierstellig eingegeben. Führende Nullen können dabei weggelassen werden. Die Namen der Schützen kommen automatisch."]
["6a","Sollte die Meldung \"Passnummer unbekannt!\" erscheinen, überprüft nochmal die Richtigkeit der eingegebenen Vereins- sowie Passnummern."]
["6b","Falls die Angaben stimmen und trotzdem besagte Fehlermeldung kommt, liegt es vermutlich daran, dass dieser Schütze noch nicht in der HSV Onlinedatenbank hinterlegt ist oder diese Datei nicht auf dem aktuellen Stand ist."]
["6c","In diesem Fall bitte unbedingt dem Rundenwettkampfleiter darüber in Kenntnis setzen! --> Im Feld für Zusätzliche Informationen, beispielsweise."]
[7,"Sowie ein vierter Schütze eingetragen wird, ändern sich die Positionsnummern automatisch."]
[8,"Das Eintragen eines Stechergebnisses ist nur bei der Heimmannschaft möglich. Der entsprechende Eintrag bei der Gastmannschaft erfolgt automatisch."]
[9,"Unter dem Punkt Zusätzliche Informationen stehen jeder Mannschaft drei Zeilen zum freien Eintragen zur Verfügung."]
[10,"Mit dem Button \"Alle eingebeben Daten LÖSCHEN\" werden alle Zellen, die beschreibbar sind, gelöscht, sodass ein neuer Wettkampf eingegeben werden kann."]
[11,"Der Rundenwettkampfbericht wird beim Ausdrucken auf eine DIN A4 Seite angepasst."]
[12,"Diese Datei enthält auszugsweise Daten aus der HSV Onlinedatenbank, natürlich verschlüsselt."]
["12a","Dabei handelt es sich um Namen, Passnummern und den jeweiligen Wettkampfpassstatus."]
[]
[]
[null,"Diese Datei wurde mit einem Datensatz der HSV Onlinedatenbank mit dem Stand vom 12. September 2018 erstellt. \nErstellt von:"]
[null,"Sascha.Losert@sb21lahndill.de"]